{"text_format":"1","workbook":"xlsx","n_sheets":12,"sheets":["Readme","Remap-comps","CVD Data","CCE & other data","Material balance","Recovery factors","OGR chart ","K-value chart","Density chart","MBO props","Rec factors calc","CVD analysis"],"not_rendered":{"charts":8,"images":0,"macros":1,"external_links":0,"defined_names":59,"comments":4,"pivot_tables":0},"unopened":[{"sheet":"Recovery factors","index":5,"reason":"not_a_worksheet"},{"sheet":"OGR chart ","index":6,"reason":"not_a_worksheet"},{"sheet":"K-value chart","index":7,"reason":"not_a_worksheet"},{"sheet":"Density chart","index":8,"reason":"not_a_worksheet"}],"bounds":{"document_bytes":16777216,"sheet_cells":100000,"rows_first":2000,"rows_last":500,"rows_between":2000,"halvings":0,"cell_chars":16384,"cell_head_chars":4096},"cells_cut":0,"cells_raw":0,"read":"whole","date_system":"1900"}

{"sheet":"Readme","index":0,"n_rows":25,"n_cols":1,"rows_kept":25,"cut":false,"hidden":false,"merged":[]}
["Gas Condensate PVT Analysis Workbook"]
["Written by Robert Mott, August 2003"]
[]
["This worksheet analyses results from CVD and CCE tests on a gas condensate fluid"]
[]
["Data should only be entered on yellow cells"]
[]
["First enter CVD data (below the dew point) on the sheet 'CVD Data'"]
["Then enter CCE relative volumes (above the dew point) on the sheet 'CCE Data'"]
[]
["Recovery factors for individual components and for stock tank oil and  gas are shown on the sheet 'Recovery factors'"]
[]
["The sheet 'CVD analysis' contains material balance calculations which can be used as a consistency check of CVD data"]
["These checks are described in 'Phase Behavior', SPE Monograph 20, by Whitson and Brule"]
[]
{"$rows_left_out":11}
{"sheet":"Remap-comps","index":1,"n_rows":19,"n_cols":5,"rows_kept":19,"cut":false,"hidden":false,"merged":[]}
["JK1"]
[]
["Nitrogen",0,null,"N2",{"$f":"B3","v":0}]
["Carbon Dioxide",0,null,"CO2",{"$f":"B4","v":0}]
["Methane",2E-3,null,"H2S",0]
["Ethane",8.0000000000000002E-3,null,"C1",{"$f":"B5","v":2E-3}]
["Propane",0.154,null,"C2",{"$f":"B6","v":8.0000000000000002E-3}]
["Isobutane",0.188,null,"C3",{"$f":"B7","v":0.154}]
["n-Butane",0.60799999999999998,null,"iC4",{"$f":"B8","v":0.188}]
["2,2 Dimethylpropane",4.0000000000000001E-3,null,"nC4",{"$f":"B9","v":0.60799999999999998}]
["Isopentane",0.83499999999999996,null,"iC5",{"$f":"SUM(B10:B11)","v":0.83899999999999997}]
["n-Pentane",1.099,null,"nC5",{"$f":"B12","v":1.099}]
["2,2 Dimethylbutane",5.5E-2,null,"C6",{"$f":"SUM(B13:B18)","v":3.234}]
["Cyclopentane",0,null,{"$f":"PlusFrac","v":"C7+"},{"$f":"B19","v":93.867000000000004}]
["2,3 Dimethylbutane",0.35599999999999998]
{"$rows_left_out":5}
{"sheet":"CVD Data","index":2,"n_rows":52,"n_cols":25,"rows_kept":52,"cut":false,"hidden":false,"merged":[]}
[null,"CVD Data",null,null,null,null,null,null,null,null,null,null,null,null,null,null,null,null,null,null,"No of pressures in CVD",null,null,"Plus fraction"]
[null,"The first pressure must be the dew point pressure",null,null,null,null,null,null,"Fill-In-Cell",null,null,null,null,null,null,null,null,null,null,null,null,null,null,null,2]
[null,"The number of pressure entries must be set to display the charts correctly",null,null,null,null,null,null,null,null,null,null,null,null,null,null,null,null,null,null,"N_pres",7,null,"N_plus",{"$f":"Y2+5","v":7}]
[null,null,null,null,null,null,null,null,null,null,null,null,null,null,null,null,null,null,null,null,null,null,null,"PlusFrac",{"$f":"CONCATENATE(\"C\",TEXT(N_plus,\"0\"),\"+\")","v":"C7+"}]
[null,"Number of pressure entries"]
[]
[null,"Plus fraction"]
[]
[null,null,null,null,null,null,null,null,null,null,null,null,null,null,null,null,null,null,null,null,null,1,null,null,"C6+"]
[null,"Pressure (psig)",5535,4500,3500,2500,1700,900,2,null,null,null,null,null,null,null,null,null,null,null,null,2,null,null,"C7+"]
[null,null,null,null,null,null,null,null,null,null,null,null,null,"Equilibrium",null,null,null,null,null,null,null,3,null,null,"C8+"]
[null,"Wellstream produced (cum %)",0,7.976,21.98,39.965000000000003,56.259,73.950999999999993,93.844999999999999,null,null,null,null,"Liquid",null,null,null,null,null,null,null,4,null,null,"C9+"]
[null,"Liquid volume (%)",0,17,22.841999999999999,23.832000000000001,22.309000000000001,19.062999999999999,14.967000000000001,null,null,null,null,"(last stage)",null,null,null,null,null,null,null,5,null,null,"C10+"]
[null,"Equilibrium gas Z-factor",1.0823,0.92020000000000002,0.85150000000000003,0.83689999999999998,0.85680000000000001,0.90690000000000004,1,null,null,null,null,null,null,null,null,null,null,null,null,6,null,null,"C11+"]
[null,null,null,null,null,null,null,null,null,null,null,null,null,null,null,null,"MW","Density",null,null,null,7,null,null,"C12+"]
{"$rows_left_out":38}
{"sheet":"CCE & other data","index":3,"n_rows":46,"n_cols":14,"rows_kept":46,"cut":false,"hidden":false,"merged":[[8,1,8,3]]}
[null,"General Information",null,null,"Fill-In-Cell"]
[]
[null,"JK-1 Gas Condensate"]
[]
[null,"Reservoir temperature (deg F)",null,null,263]
[]
[null,"Initial pressure (psig)",null,null,10440]
[]
[null,"Definition of oil for surface oil and gas recoveries",null,null,"C5+"]
[]
[]
[null,"CCE Data"]
[null,"only enter data at or above dew point pressure"]
[null,"enter pressures in descending order"]
[]
{"$rows_left_out":32}
{"sheet":"Material balance","index":4,"n_rows":28,"n_cols":12,"rows_kept":28,"cut":false,"hidden":false,"merged":[]}
[]
[null,null,null,null,null,null,null,null,null,null,"Fill-In-Cell"]
[null,"Forward material balance",null,null,null,null,"Backward material balance"]
[null,"Calculates residual liquid composition",null,null,null,null,"Calculates initial gas composition"]
[]
[null,null,null,null,null,"Calculated density of residual liquid",null,null,{"$f":"INDEX('CVD analysis'!C49:K49,N_pres)","v":44.554043676349629},"lb/ft3"]
[null,null,null,null,null,"Density of res. Oil to use in calculation",null,null,{"$f":"K7*62.42797","v":51.278334558000005},"lb/ft3",0.82140000000000002,"g/cc"]
[]
[null,null,"Measured","Calculated",null,null,null,"Measured","Calculated"]
[null,{"$f":"'CVD Data'!B17","v":"N2"},{"$f":"'CVD Data'!N17","v":0},{"$f":"INDEX('CVD analysis'!C96:L96,N_pres)","v":0.10318197046067223},null,null,{"$f":"'CVD Data'!B17","v":"N2"},{"$f":"'CVD Data'!C17","v":0.39300000000000002},{"$f":"'CVD analysis'!C138","v":0.38686513036208942}]
[null,{"$f":"'CVD Data'!B18","v":"CO2"},{"$f":"'CVD Data'!N18","v":0},{"$f":"INDEX('CVD analysis'!C97:L97,N_pres)","v":0.73083760181294333},null,null,{"$f":"'CVD Data'!B18","v":"CO2"},{"$f":"'CVD Data'!C18","v":1.776},{"$f":"'CVD analysis'!C139","v":1.7327008748468302}]
[null,{"$f":"'CVD Data'!B19","v":"H2S"},{"$f":"'CVD Data'!N19","v":0},{"$f":"INDEX('CVD analysis'!C98:L98,N_pres)","v":0},null,null,{"$f":"'CVD Data'!B19","v":"H2S"},{"$f":"'CVD Data'!C19","v":0},{"$f":"'CVD analysis'!C140","v":0}]
[null,{"$f":"'CVD Data'!B20","v":"C1"},{"$f":"'CVD Data'!N20","v":2E-3},{"$f":"INDEX('CVD analysis'!C99:L99,N_pres)","v":13.273940857711361},null,null,{"$f":"'CVD Data'!B20","v":"C1"},{"$f":"'CVD Data'!C20","v":68.25},{"$f":"'CVD analysis'!C141","v":67.457443358171233}]
[null,{"$f":"'CVD Data'!B21","v":"C2"},{"$f":"'CVD Data'!N21","v":8.0000000000000002E-3},{"$f":"INDEX('CVD analysis'!C100:L100,N_pres)","v":0.75350219935224794},null,null,{"$f":"'CVD Data'!B21","v":"C2"},{"$f":"'CVD Data'!C21","v":7.024},{"$f":"'CVD analysis'!C142","v":6.9787124125259128}]
[null,{"$f":"'CVD Data'!B22","v":"C3"},{"$f":"'CVD Data'!N22","v":0.154},{"$f":"INDEX('CVD analysis'!C101:L101,N_pres)","v":1.3149334828029289},null,null,{"$f":"'CVD Data'!B22","v":"C3"},{"$f":"'CVD Data'!C22","v":6.625},{"$f":"'CVD analysis'!C143","v":6.5551273806385186}]
{"$rows_left_out":14}
{"sheet":"MBO props","index":9,"n_rows":44,"n_cols":16,"rows_kept":44,"cut":false,"hidden":false,"merged":[]}
["Calculated modified black oil properties"]
[]
[]
["Pressure (psia)",null,{"$f":"'CVD Data'!C10","v":5535},{"$f":"'CVD Data'!D10","v":4500},{"$f":"'CVD Data'!E10","v":3500},{"$f":"'CVD Data'!F10","v":2500},{"$f":"'CVD Data'!G10","v":1700},{"$f":"'CVD Data'!H10","v":900},{"$f":"'CVD Data'!I10","v":2},{"$f":"'CVD Data'!J10","v":0},{"$f":"'CVD Data'!K10","v":0},{"$f":"'CVD Data'!L10","v":0}]
["Pressure (psia)","P",{"$f":"C4+Pstd","v":5549.7},{"$f":"D4+Pstd","v":4514.7},3514.7,2514.6999999999998,1714.7,914.7,16.7,14.7,14.7,14.7]
[]
["Moles of Gas",null,null,null,null,null,null,null,null,null,null,null,null,"Carbon_no"]
["up to C3",null,{"$f":"SUM('CVD Data'!C17:C22)","v":84.067999999999998},{"$f":"SUM('CVD Data'!D17:D22)","v":87.825999999999993},{"$f":"SUM('CVD Data'!E17:E22)","v":90.38000000000001},{"$f":"SUM('CVD Data'!F17:F22)","v":91.843999999999994},{"$f":"SUM('CVD Data'!G17:G22)","v":92.544000000000011},{"$f":"SUM('CVD Data'!H17:H22)","v":91.899000000000001},{"$f":"SUM('CVD Data'!I17:I22)","v":77.334000000000003},{"$f":"SUM('CVD Data'!J17:J22)","v":0},{"$f":"SUM('CVD Data'!K17:K22)","v":0},{"$f":"SUM('CVD Data'!L17:L22)","v":0}]
["C4",null,{"$f":"IF(Oil_frac>Carbon_no,'CVD Data'!C23+'CVD Data'!C24,0)","v":3.7370000000000001},{"$f":"IF(Oil_frac>Carbon_no,'CVD Data'!D23+'CVD Data'!D24,0)","v":3.5300000000000002},{"$f":"IF(Oil_frac>Carbon_no,'CVD Data'!E23+'CVD Data'!E24,0)","v":3.4249999999999998},{"$f":"IF(Oil_frac>Carbon_no,'CVD Data'!F23+'CVD Data'!F24,0)","v":3.4130000000000003},{"$f":"IF(Oil_frac>Carbon_no,'CVD Data'!G23+'CVD Data'!G24,0)","v":3.4370000000000003},{"$f":"IF(Oil_frac>Carbon_no,'CVD Data'!H23+'CVD Data'!H24,0)","v":3.8220000000000001},{"$f":"IF(Oil_frac>Carbon_no,'CVD Data'!I23+'CVD Data'!I24,0)","v":5.234},{"$f":"IF(Oil_frac>Carbon_no,'CVD Data'!J23+'CVD Data'!J24,0)","v":0},{"$f":"IF(Oil_frac>Carbon_no,'CVD Data'!K23+'CVD Data'!K24,0)","v":0},{"$f":"IF(Oil_frac>Carbon_no,'CVD Data'!L23+'CVD Data'!L24,0)","v":0},null,4]
["C5",null,{"$f":"IF(Oil_frac>Carbon_no,'CVD Data'!C25+'CVD Data'!C26,0)","v":0},{"$f":"IF(Oil_frac>Carbon_no,'CVD Data'!D25+'CVD Data'!D26,0)","v":0},{"$f":"IF(Oil_frac>Carbon_no,'CVD Data'!E25+'CVD Data'!E26,0)","v":0},{"$f":"IF(Oil_frac>Carbon_no,'CVD Data'!F25+'CVD Data'!F26,0)","v":0},{"$f":"IF(Oil_frac>Carbon_no,'CVD Data'!G25+'CVD Data'!G26,0)","v":0},{"$f":"IF(Oil_frac>Carbon_no,'CVD Data'!H25+'CVD Data'!H26,0)","v":0},{"$f":"IF(Oil_frac>Carbon_no,'CVD Data'!I25+'CVD Data'!I26,0)","v":0},{"$f":"IF(Oil_frac>Carbon_no,'CVD Data'!J25+'CVD Data'!J26,0)","v":0},{"$f":"IF(Oil_frac>Carbon_no,'CVD Data'!K25+'CVD Data'!K26,0)","v":0},{"$f":"IF(Oil_frac>Carbon_no,'CVD Data'!L25+'CVD Data'!L26,0)","v":0},null,5]
["C6",null,{"$f":"IF(Oil_frac>Carbon_no,'CVD Data'!C27,0)","v":0},{"$f":"IF(Oil_frac>Carbon_no,'CVD Data'!D27,0)","v":0},{"$f":"IF(Oil_frac>Carbon_no,'CVD Data'!E27,0)","v":0},{"$f":"IF(Oil_frac>Carbon_no,'CVD Data'!F27,0)","v":0},{"$f":"IF(Oil_frac>Carbon_no,'CVD Data'!G27,0)","v":0},{"$f":"IF(Oil_frac>Carbon_no,'CVD Data'!H27,0)","v":0},{"$f":"IF(Oil_frac>Carbon_no,'CVD Data'!I27,0)","v":0},{"$f":"IF(Oil_frac>Carbon_no,'CVD Data'!J27+'CVD Data'!J33,0)","v":0},{"$f":"IF(Oil_frac>Carbon_no,'CVD Data'!K27+'CVD Data'!K33,0)","v":0},{"$f":"IF(Oil_frac>Carbon_no,'CVD Data'!L27+'CVD Data'!L33,0)","v":0},null,6]
["Gas volume at surface  (ft3/mol of equil gas)",null,{"$f":"SUM(C8:C11)*UGC*Tstd/Pstd/100","v":333.33884027210877},346.81969240816323,356.1169627210885,361.62926835374145,364.377828462585,363.39077648979588,313.45733572789112,0,0,0]
[]
[]
["Moles of oil"]
{"$rows_left_out":30}
{"sheet":"Rec factors calc","index":10,"n_rows":61,"n_cols":20,"rows_kept":61,"cut":false,"hidden":false,"merged":[]}
["Calculated recovery factors"]
[]
[]
["Calculated recovery factors for each component"]
[]
["Abandonment pressure (psia)",{"$f":"P_init","v":10440},{"$f":"IF('CVD Data'!C10>1,'CVD Data'!C10,A6)","v":5535},{"$f":"IF('CVD Data'!D10>1,'CVD Data'!D10,B6)","v":4500},{"$f":"IF('CVD Data'!E10>1,'CVD Data'!E10,D6)","v":3500},{"$f":"IF('CVD Data'!F10>1,'CVD Data'!F10,E6)","v":2500},{"$f":"IF('CVD Data'!G10>1,'CVD Data'!G10,F6)","v":1700},{"$f":"IF('CVD Data'!H10>1,'CVD Data'!H10,G6)","v":900},{"$f":"IF('CVD Data'!I10>1,'CVD Data'!I10,H6)","v":2},{"$f":"IF('CVD Data'!J10>1,'CVD Data'!J10,I6)","v":2},{"$f":"IF('CVD Data'!K10>1,'CVD Data'!K10,J6)","v":2},{"$f":"IF('CVD Data'!L10>1,'CVD Data'!L10,K6)","v":2}]
[]
["Component"]
[{"$f":"'CVD Data'!B20","v":"C1"},0,{"$f":"IF(C$6=\"\",\"\",1-'CVD analysis'!C56/'CVD analysis'!$C56*N_init)","v":0.16285000000000005},{"$f":"IF(D$6=\"\",\"\",1-'CVD analysis'!D56/'CVD analysis'!$C56*N_init)","v":0.2332047100907253},{"$f":"IF(E$6=\"\",\"\",1-'CVD analysis'!E56/'CVD analysis'!$C56*N_init)","v":0.3608984017354725},{"$f":"IF(F$6=\"\",\"\",1-'CVD analysis'!F56/'CVD analysis'!$C56*N_init)","v":0.52753736306140664},{"$f":"IF(G$6=\"\",\"\",1-'CVD analysis'!G56/'CVD analysis'!$C56*N_init)","v":0.67952975356439571},{"$f":"IF(H$6=\"\",\"\",1-'CVD analysis'!H56/'CVD analysis'!$C56*N_init)","v":0.84168531801705493},{"$f":"IF(I$6=\"\",\"\",1-'CVD analysis'!I56/'CVD analysis'!$C56*N_init)","v":0.98838435522259338},{"$f":"IF(J$6=\"\",\"\",1-'CVD analysis'!J56/'CVD analysis'!$C56*N_init)","v":0.98838435522259338},{"$f":"IF(K$6=\"\",\"\",1-'CVD analysis'!K56/'CVD analysis'!$C56*N_init)","v":0.98838435522259338},{"$f":"IF(L$6=\"\",\"\",1-'CVD analysis'!L56/'CVD analysis'!$C56*N_init)","v":0.98838435522259338}]
[{"$f":"'CVD Data'!B21","v":"C2"},0,{"$f":"IF(C$6=\"\",\"\",1-'CVD analysis'!C57/'CVD analysis'!$C57*N_init)","v":0.16285000000000005},{"$f":"IF(D$6=\"\",\"\",1-'CVD analysis'!D57/'CVD analysis'!$C57*N_init)","v":0.23108502860933955},{"$f":"IF(E$6=\"\",\"\",1-'CVD analysis'!E57/'CVD analysis'!$C57*N_init)","v":0.3519914375763098},{"$f":"IF(F$6=\"\",\"\",1-'CVD analysis'!F57/'CVD analysis'!$C57*N_init)","v":0.51198438957801828},{"$f":"IF(G$6=\"\",\"\",1-'CVD analysis'!G57/'CVD analysis'!$C57*N_init)","v":0.6599832775679102},{"$f":"IF(H$6=\"\",\"\",1-'CVD analysis'!H57/'CVD analysis'!$C57*N_init)","v":0.82215626637742023},{"$f":"IF(I$6=\"\",\"\",1-'CVD analysis'!I57/'CVD analysis'!$C57*N_init)","v":0.99235030589023354},{"$f":"IF(J$6=\"\",\"\",1-'CVD analysis'!J57/'CVD analysis'!$C57*N_init)","v":0.99235030589023354},{"$f":"IF(K$6=\"\",\"\",1-'CVD analysis'!K57/'CVD analysis'!$C57*N_init)","v":0.99235030589023354},{"$f":"IF(L$6=\"\",\"\",1-'CVD analysis'!L57/'CVD analysis'!$C57*N_init)","v":0.99235030589023354},null,null,null,"V_Pinit",{"$f":"Tablook(-P_init,P_CCE,V_CCE)","v":0.83714999999999995}]
[{"$f":"'CVD Data'!B22","v":"C3"},0,{"$f":"IF(C$6=\"\",\"\",1-'CVD analysis'!C58/'CVD analysis'!$C58*N_init)","v":0.16285000000000005},{"$f":"IF(D$6=\"\",\"\",1-'CVD analysis'!D58/'CVD analysis'!$C58*N_init)","v":0.2283713308806038},{"$f":"IF(E$6=\"\",\"\",1-'CVD analysis'!E58/'CVD analysis'!$C58*N_init)","v":0.34341154121811324},{"$f":"IF(F$6=\"\",\"\",1-'CVD analysis'!F58/'CVD analysis'!$C58*N_init)","v":0.49115491332037742},{"$f":"IF(G$6=\"\",\"\",1-'CVD analysis'!G58/'CVD analysis'!$C58*N_init)","v":0.62500704037260379},{"$f":"IF(H$6=\"\",\"\",1-'CVD analysis'!H58/'CVD analysis'!$C58*N_init)","v":0.78400299610633961},{"$f":"IF(I$6=\"\",\"\",1-'CVD analysis'!I58/'CVD analysis'!$C58*N_init)","v":0.98739867105139623},{"$f":"IF(J$6=\"\",\"\",1-'CVD analysis'!J58/'CVD analysis'!$C58*N_init)","v":0.98739867105139623},{"$f":"IF(K$6=\"\",\"\",1-'CVD analysis'!K58/'CVD analysis'!$C58*N_init)","v":0.98739867105139623},{"$f":"IF(L$6=\"\",\"\",1-'CVD analysis'!L58/'CVD analysis'!$C58*N_init)","v":0.98739867105139623},null,null,null,"V_Pdew",{"$f":"Tablook(-Pdew,P_CCE,V_CCE)","v":1}]
["C4's",0,{"$f":"IF(C$6=\"\",\"\",1-('CVD analysis'!C59+'CVD analysis'!C60)/('CVD analysis'!$C59+'CVD analysis'!$C60)*N_init)","v":0.16285000000000005},{"$f":"IF(D$6=\"\",\"\",1-('CVD analysis'!D59+'CVD analysis'!D60)/('CVD analysis'!$C59+'CVD analysis'!$C60)*N_init)","v":0.22592249839978606},{"$f":"IF(E$6=\"\",\"\",1-('CVD analysis'!E59+'CVD analysis'!E60)/('CVD analysis'!$C59+'CVD analysis'!$C60)*N_init)","v":0.3333691439844797},{"$f":"IF(F$6=\"\",\"\",1-('CVD analysis'!F59+'CVD analysis'!F60)/('CVD analysis'!$C59+'CVD analysis'!$C60)*N_init)","v":0.47087681111252366},{"$f":"IF(G$6=\"\",\"\",1-('CVD analysis'!G59+'CVD analysis'!G60)/('CVD analysis'!$C59+'CVD analysis'!$C60)*N_init)","v":0.5963316531186782},{"$f":"IF(H$6=\"\",\"\",1-('CVD analysis'!H59+'CVD analysis'!H60)/('CVD analysis'!$C59+'CVD analysis'!$C60)*N_init)","v":0.74780903741517246},{"$f":"IF(I$6=\"\",\"\",1-('CVD analysis'!I59+'CVD analysis'!I60)/('CVD analysis'!$C59+'CVD analysis'!$C60)*N_init)","v":0.98106675170845603},{"$f":"IF(J$6=\"\",\"\",1-('CVD analysis'!J59+'CVD analysis'!J60)/('CVD analysis'!$C59+'CVD analysis'!$C60)*N_init)","v":0.98106675170845603},{"$f":"IF(K$6=\"\",\"\",1-('CVD analysis'!K59+'CVD analysis'!K60)/('CVD analysis'!$C59+'CVD analysis'!$C60)*N_init)","v":0.98106675170845603},{"$f":"IF(L$6=\"\",\"\",1-('CVD analysis'!L59+'CVD analysis'!L60)/('CVD analysis'!$C59+'CVD analysis'!$C60)*N_init)","v":0.98106675170845603},null,null,null,"N_init",{"$f":"V_Pinit/V_Pdew","v":0.83714999999999995}]
["C5's",0,{"$f":"IF(C$6=\"\",\"\",1-('CVD analysis'!C61+'CVD analysis'!C62)/('CVD analysis'!$C61+'CVD analysis'!$C62)*N_init)","v":0.16285000000000005},{"$f":"IF(D$6=\"\",\"\",1-('CVD analysis'!D61+'CVD analysis'!D62)/('CVD analysis'!$C61+'CVD analysis'!$C62)*N_init)","v":0.2252194586862859},{"$f":"IF(E$6=\"\",\"\",1-('CVD analysis'!E61+'CVD analysis'!E62)/('CVD analysis'!$C61+'CVD analysis'!$C62)*N_init)","v":0.33030958357033546},{"$f":"IF(F$6=\"\",\"\",1-('CVD analysis'!F61+'CVD analysis'!F62)/('CVD analysis'!$C61+'CVD analysis'!$C62)*N_init)","v":0.4579190335997646},{"$f":"IF(G$6=\"\",\"\",1-('CVD analysis'!G61+'CVD analysis'!G62)/('CVD analysis'!$C61+'CVD analysis'!$C62)*N_init)","v":0.56799058038669803},{"$f":"IF(H$6=\"\",\"\",1-('CVD analysis'!H61+'CVD analysis'!H62)/('CVD analysis'!$C61+'CVD analysis'!$C62)*N_init)","v":0.70546393383343131},{"$f":"IF(I$6=\"\",\"\",1-('CVD analysis'!I61+'CVD analysis'!I62)/('CVD analysis'!$C61+'CVD analysis'!$C62)*N_init)","v":0.93719245416539143},{"$f":"IF(J$6=\"\",\"\",1-('CVD analysis'!J61+'CVD analysis'!J62)/('CVD analysis'!$C61+'CVD analysis'!$C62)*N_init)","v":0.93719245416539143},{"$f":"IF(K$6=\"\",\"\",1-('CVD analysis'!K61+'CVD analysis'!K62)/('CVD analysis'!$C61+'CVD analysis'!$C62)*N_init)","v":0.93719245416539143},{"$f":"IF(L$6=\"\",\"\",1-('CVD analysis'!L61+'CVD analysis'!L62)/('CVD analysis'!$C61+'CVD analysis'!$C62)*N_init)","v":0.93719245416539143}]
[{"$f":"'CVD Data'!B27","v":"C6"},0,{"$f":"IF(C$6=\"\",\"\",1-'CVD analysis'!C63/'CVD analysis'!$C63*N_init)","v":0.16285000000000005},{"$f":"IF(D$6=\"\",\"\",1-'CVD analysis'!D63/'CVD analysis'!$C63*N_init)","v":0.22196448242561984},{"$f":"IF(E$6=\"\",\"\",1-'CVD analysis'!E63/'CVD analysis'!$C63*N_init)","v":0.31534029720454548},{"$f":"IF(F$6=\"\",\"\",1-'CVD analysis'!F63/'CVD analysis'!$C63*N_init)","v":0.42437290121022742},{"$f":"IF(G$6=\"\",\"\",1-'CVD analysis'!G63/'CVD analysis'!$C63*N_init)","v":0.5155445726844009},{"$f":"IF(H$6=\"\",\"\",1-'CVD analysis'!H63/'CVD analysis'!$C63*N_init)","v":0.62280088795092969},{"$f":"IF(I$6=\"\",\"\",1-'CVD analysis'!I63/'CVD analysis'!$C63*N_init)","v":0.84095795760795466},{"$f":"IF(J$6=\"\",\"\",1-'CVD analysis'!J63/'CVD analysis'!$C63*N_init)","v":0.84095795760795466},{"$f":"IF(K$6=\"\",\"\",1-'CVD analysis'!K63/'CVD analysis'!$C63*N_init)","v":0.84095795760795466},{"$f":"IF(L$6=\"\",\"\",1-'CVD analysis'!L63/'CVD analysis'!$C63*N_init)","v":0.84095795760795466}]
[{"$f":"'CVD Data'!B33","v":"C7+"},0,{"$f":"IF(C$6=\"\",\"\",1-'CVD analysis'!C69/'CVD analysis'!$C69*N_init)","v":0.16285000000000005},{"$f":"IF(D$6=\"\",\"\",1-'CVD analysis'!D69/'CVD analysis'!$C69*N_init)","v":0.206294298541295},{"$f":"IF(E$6=\"\",\"\",1-'CVD analysis'!E69/'CVD analysis'!$C69*N_init)","v":0.25427567071046286},{"$f":"IF(F$6=\"\",\"\",1-'CVD analysis'!F69/'CVD analysis'!$C69*N_init)","v":0.29535655133802086},{"$f":"IF(G$6=\"\",\"\",1-'CVD analysis'!G69/'CVD analysis'!$C69*N_init)","v":0.3239860446741526},{"$f":"IF(H$6=\"\",\"\",1-'CVD analysis'!H69/'CVD analysis'!$C69*N_init)","v":0.35507190426067803},{"$f":"IF(I$6=\"\",\"\",1-'CVD analysis'!I69/'CVD analysis'!$C69*N_init)","v":0.59626071418826765},{"$f":"IF(J$6=\"\",\"\",1-'CVD analysis'!J69/'CVD analysis'!$C69*N_init)","v":0.59626071418826765},{"$f":"IF(K$6=\"\",\"\",1-'CVD analysis'!K69/'CVD analysis'!$C69*N_init)","v":0.59626071418826765},{"$f":"IF(L$6=\"\",\"\",1-'CVD analysis'!L69/'CVD analysis'!$C69*N_init)","v":0.59626071418826765}]
{"$rows_left_out":47}
{"sheet":"CVD analysis","index":11,"n_rows":157,"n_cols":18,"rows_kept":157,"cut":false,"hidden":false,"merged":[]}
[]
["temperature (deg R)","Tres",{"$f":"'CCE & other data'!E5+459.67","v":722.67000000000007},"deg R",null,null,null,null,null,null,null,null,null,"UGC",10.731999999999999]
[]
[]
["pressure (psia)","P",{"$f":"'CVD Data'!C10+Pstd","v":5549.7},{"$f":"'CVD Data'!D10+Pstd","v":4514.7},{"$f":"'CVD Data'!E10+Pstd","v":3514.7},{"$f":"'CVD Data'!F10+Pstd","v":2514.6999999999998},{"$f":"'CVD Data'!G10+Pstd","v":1714.7},{"$f":"'CVD Data'!H10+Pstd","v":914.7},{"$f":"'CVD Data'!I10+Pstd","v":16.7},{"$f":"'CVD Data'!J10+14.7","v":14.7},{"$f":"'CVD Data'!K10+14.7","v":14.7},{"$f":"'CVD Data'!L10+14.7","v":14.7}]
[]
["wellstream produced (cum fraction)","Np",{"$f":"'CVD Data'!C12/100","v":0},{"$f":"'CVD Data'!D12/100","v":7.9759999999999998E-2},{"$f":"'CVD Data'!E12/100","v":0.2198},{"$f":"'CVD Data'!F12/100","v":0.39965000000000006},{"$f":"'CVD Data'!G12/100","v":0.56259000000000003},{"$f":"'CVD Data'!H12/100","v":0.73950999999999989},{"$f":"'CVD Data'!I12/100","v":0.93845000000000001},{"$f":"'CVD Data'!J12/100","v":0},{"$f":"'CVD Data'!K12/100","v":0},{"$f":"'CVD Data'!L12/100","v":0}]
["liquid volume (fraction)","SL",{"$f":"'CVD Data'!C13/100","v":0},{"$f":"'CVD Data'!D13/100","v":0.17},{"$f":"'CVD Data'!E13/100","v":0.22841999999999998},{"$f":"'CVD Data'!F13/100","v":0.23832},{"$f":"'CVD Data'!G13/100","v":0.22309000000000001},{"$f":"'CVD Data'!H13/100","v":0.19062999999999999},{"$f":"'CVD Data'!I13/100","v":0.14967},{"$f":"'CVD Data'!J13/100","v":0},{"$f":"'CVD Data'!K13/100","v":0},{"$f":"'CVD Data'!L13/100","v":0}]
["eq gas Z-factor","Z",{"$f":"'CVD Data'!C14","v":1.0823},{"$f":"'CVD Data'!D14","v":0.92020000000000002},{"$f":"'CVD Data'!E14","v":0.85150000000000003},{"$f":"'CVD Data'!F14","v":0.83689999999999998},{"$f":"'CVD Data'!G14","v":0.85680000000000001},{"$f":"'CVD Data'!H14","v":0.90690000000000004},{"$f":"'CVD Data'!I14","v":1},{"$f":"'CVD Data'!J14","v":0},{"$f":"'CVD Data'!K14","v":0},{"$f":"'CVD Data'!L14","v":0}]
[]
[null,"Produced gas phase composition"]
["gas phase composition",{"$f":"'CVD Data'!B17","v":"N2"},{"$f":"'CVD Data'!C17","v":0.39300000000000002},{"$f":"'CVD Data'!D17","v":0.40500000000000003},{"$f":"'CVD Data'!E17","v":0.433},{"$f":"'CVD Data'!F17","v":0.442},{"$f":"'CVD Data'!G17","v":0.437},{"$f":"'CVD Data'!H17","v":0.42799999999999999},{"$f":"'CVD Data'!I17","v":0.33500000000000002},{"$f":"'CVD Data'!J17","v":0},{"$f":"'CVD Data'!K17","v":0},{"$f":"'CVD Data'!L17","v":0}]
[null,{"$f":"'CVD Data'!B18","v":"CO2"},{"$f":"'CVD Data'!C18","v":1.776},{"$f":"'CVD Data'!D18","v":1.829},{"$f":"'CVD Data'!E18","v":1.863},{"$f":"'CVD Data'!F18","v":1.899},{"$f":"'CVD Data'!G18","v":1.9359999999999999},{"$f":"'CVD Data'!H18","v":1.9450000000000001},{"$f":"'CVD Data'!I18","v":1.6120000000000001},{"$f":"'CVD Data'!J18","v":0},{"$f":"'CVD Data'!K18","v":0},{"$f":"'CVD Data'!L18","v":0}]
[null,{"$f":"'CVD Data'!B19","v":"H2S"},{"$f":"'CVD Data'!C19","v":0},{"$f":"'CVD Data'!D19","v":0},{"$f":"'CVD Data'!E19","v":0},{"$f":"'CVD Data'!F19","v":0},{"$f":"'CVD Data'!G19","v":0},{"$f":"'CVD Data'!H19","v":0},{"$f":"'CVD Data'!I19","v":0},{"$f":"'CVD Data'!J19","v":0},{"$f":"'CVD Data'!K19","v":0},{"$f":"'CVD Data'!L19","v":0}]
[null,{"$f":"'CVD Data'!B20","v":"C1"},{"$f":"'CVD Data'!C20","v":68.25},{"$f":"'CVD Data'!D20","v":71.912999999999997},{"$f":"'CVD Data'!E20","v":74.338999999999999},{"$f":"'CVD Data'!F20","v":75.537999999999997},{"$f":"'CVD Data'!G20","v":76.049000000000007},{"$f":"'CVD Data'!H20","v":74.722999999999999},{"$f":"'CVD Data'!I20","v":60.118000000000002},{"$f":"'CVD Data'!J20","v":0},{"$f":"'CVD Data'!K20","v":0},{"$f":"'CVD Data'!L20","v":0}]
{"$rows_left_out":142}